{"text_format":"1","workbook":"xlsx","n_sheets":6,"sheets":["Dashboard","Data_Clients","Data_Temps","Data_Revenus","Config","TCD_Data"],"not_rendered":{"charts":3,"images":0,"macros":1,"external_links":0,"defined_names":6,"comments":0,"pivot_tables":0},"unopened":[],"bounds":{"document_bytes":16777216,"sheet_cells":100000,"rows_first":2000,"rows_last":500,"rows_between":2000,"halvings":0,"cell_chars":16384,"cell_head_chars":4096},"cells_cut":0,"cells_raw":0,"read":"whole","date_system":"1900"}

{"sheet":"Dashboard","index":0,"n_rows":16,"n_cols":2,"rows_kept":16,"cut":false,"hidden":false,"merged":[[0,0,0,2]]}
["FREELANCE DASHBOARD"]
[]
["KPIs Principaux"]
["CA Total",{"$f":"SUM(#REF!)","v":{"$error":"#REF!"}}]
["CA Mois en cours",{"$f":"SUMPRODUCT((MONTH(#REF!)=MONTH(TODAY()))*(YEAR(#REF!)=YEAR(TODAY()))*#REF!)","v":{"$error":"#REF!"}}]
["Heures Totales",{"$f":"SUM(#REF!)","v":{"$error":"#REF!"}}]
["Taux Horaire Moyen",{"$f":"IFERROR(B4/B6,0)","v":0}]
["Nb Clients",{"$f":"COUNTA(tbl_Clients[ClientID])","v":5}]
["Heures Cette Semaine",{"$f":"SUMIFS(#REF!,#REF!,\">=\"&(TODAY()-WEEKDAY(TODAY(),2)+1),#REF!,\"<=\"&(TODAY()-WEEKDAY(TODAY(),2)+7))","v":{"$error":"#REF!"}}]
[]
["Top Client",{"$f":"_xlfn.XLOOKUP(_xlfn.XLOOKUP(MAX(TCD_Data!B2:B6),TCD_Data!B2:B6,TCD_Data!A2:A6),tbl_Clients[ClientID],tbl_Clients[Nom])","v":{"$error":"#N/A"}}]
[]
["Statistiques"]
["Date Debut Donnees",{"$f":"MIN(#REF!)","v":{"$error":"#REF!"}}]
["Date Fin Donnees",{"$f":"MAX(#REF!)","v":{"$error":"#REF!"}}]
["Nb Projets Uniques",{"$f":"COUNTA(_xlfn.UNIQUE(#REF!))","v":1}]

{"sheet":"Data_Clients","index":1,"n_rows":6,"n_cols":4,"rows_kept":6,"cut":false,"hidden":false,"merged":[]}
["ClientID","Nom","Secteur","DateDebut"]
["CLI001","Acme Corporation","Tech","15/01/2024"]
["CLI002","Tech Solutions","Tech","2024-01-03"]
["CLI003","Marketing Pro","Marketing","2024-10-06"]
["CLI004","E-Shop Plus","E-commerce","22/09/2024"]
["CLI005","Finance Group","Finance","2024-05-11"]

{"sheet":"Data_Temps","index":2,"n_rows":11,"n_cols":5,"rows_kept":11,"cut":false,"hidden":false,"merged":[]}
["Date","ClientID","Projet","Heures","Description"]
["2025-02-01","CLI001","Site Web",3.5,"Maquettes"]
["2025-02-01","CLI002","API Backend",6,"Endpoints"]
["2025-03-01","CLI001","Site Web",4,"Integration"]
["2025-03-01","CLI003","Campagne SEO",2.5,"Audit"]
["2025-06-01","CLI002","API Backend",7,"Tests"]
["2025-06-01","CLI004","Boutique",5,"Setup"]
["2025-07-01","CLI001","Maintenance",1.5,"Updates"]
["2025-08-01","CLI003","Campagne SEO",3,"Keywords"]
["2025-08-01","CLI005","Dashboard",4.5,"Design"]
["2025-09-01","CLI002","App Mobile",6.5,"Screens"]

{"sheet":"Data_Revenus","index":3,"n_rows":8,"n_cols":4,"rows_kept":8,"cut":false,"hidden":false,"merged":[]}
["Date","ClientID","Montant","Type"]
["15/01/2025","CLI001",2500,"Facture"]
["20/01/2025","CLI002",4200,"Facture"]
["25/01/2025","CLI003",1800,"Facture"]
["28/01/2025","CLI001",1000,"Acompte"]
["31/01/2025","CLI004",3500,"Facture"]
["2025-05-02","CLI002",2800,"Facture"]
["2025-10-02","CLI005",1500,"Acompte"]

{"sheet":"Config","index":4,"n_rows":8,"n_cols":6,"rows_kept":8,"cut":false,"hidden":false,"merged":[]}
["Parametre","Valeur",null,"Secteurs",null,"Types"]
["AnneeCourante",2025,null,"Tech",null,"Facture"]
["TauxHoraireDefaut",75,null,"Marketing",null,"Acompte"]
["DevisePrincipale","EUR",null,"Finance",null,"Avoir"]
["ObjectifMensuel",10000,null,"E-commerce",null,"Autre"]
["ObjectifHeures",140,null,"Industrie"]
["JourDebutSemaine",2,null,"Services"]
[null,null,null,"Autre"]

{"sheet":"TCD_Data","index":5,"n_rows":0,"n_cols":0,"rows_kept":0,"cut":false,"hidden":false,"merged":[]}